BDBM311059 US10155733, Example 12::US10155733, Strucure 7e
SMILES OC(C1CCCC1)(C(=O)N1CCN(C\C=C\c2ccccc2)CC1)c1ccccc1
InChI Key InChIKey=YWKGWILANWSBAW-FMIVXFBMSA-N
Data  1 IC50
  Tab Delimited (TSV)   2D SDfile   Computed 3D by Vconf -m prep SDfile
Find this compound or compounds like it in BindingDB:
Activity Spreadsheet -- Enzyme Inhibition Constant Data from BindingDB
Found 1 hit for monomerid = 311059
TargetMuscarinic acetylcholine receptor M3(Homo sapiens (Human))
Conopco
US Patent
LigandPNGBDBM311059(US10155733, Example 12 | US10155733, Strucure 7e)
Affinity DataIC50:  195nM. Assay description: The muscarinic 3 receptor binding assay was adapted from Perkin Elmer. Briefly, assay buffer (60 μL of pH 7.4 phosphate saline buffer) was added...
Ligand InfoPC cidPC sid
In DepthDetails US Patent