BDBM311077 US10155750, Example 3
SMILES CCN(CCn1ncc(n1)C(C)O)C(=O)c1ccccc1-n1nccn1
InChI Key InChIKey=MLYWKHNDYGSIGK-UHFFFAOYSA-N
Data  2 IC50
  Tab Delimited (TSV)   2D SDfile   Computed 3D by Vconf -m prep SDfile
Find this compound or compounds like it in BindingDB:
Activity Spreadsheet -- Enzyme Inhibition Constant Data from BindingDB
Found 2 hits for monomerid = 311077
TargetOrexin/Hypocretin receptor type 1(Homo sapiens (Human))
Merck Sharp & Dohme
US Patent
LigandPNGBDBM311077(US10155750, Example 3)
Affinity DataIC50:  1.00E+4nM. Assay description: The cells are seeded at 20,000 cells/well into Becton-Dickinson black 384-well clear bottom sterile plates coated with poly-D-lysine. All reagents we...
Ligand InfoPC cidPC sid
In DepthDetails US Patent
TargetOrexin receptor type 2(Homo sapiens (Human))
Merck Sharp & Dohme
US Patent
LigandPNGBDBM311077(US10155750, Example 3)
Affinity DataIC50:  373nM. Assay description: The cells are seeded at 20,000 cells/well into Becton-Dickinson black 384-well clear bottom sterile plates coated with poly-D-lysine. All reagents we...
Ligand InfoPC cidPC sid
In DepthDetails US Patent