BDBM311406 US10155764, Example 3
SMILES COc1ccc2c(c1)c(NCCN(C)C)nn(C)c2=O
InChI Key InChIKey=SKGMMOLMCPDPCE-UHFFFAOYSA-N
Data  1 IC50
  Tab Delimited (TSV)   2D SDfile   Computed 3D by Vconf -m prep SDfile
Find this compound or compounds like it in BindingDB:
Activity Spreadsheet -- Enzyme Inhibition Constant Data from BindingDB
Found 1 hit for monomerid = 311406
TargetHistone acetyltransferase KAT2B [719-832](Homo sapiens (Human))
Genentech
US Patent
LigandPNGBDBM311406(US10155764, Example 3)
Affinity DataIC50:  410nM. Assay description: His/Flag epitope tagged PCAF719-832 bromodomain was cloned, expressed and purified to homogeneity in-house. PCAF bromodomain binding and inhibition o...
Ligand InfoPC cidPC sid
In DepthDetails US Patent