BDBM311524 5-{[cis-2- aminocyclohexyl]amino}- N-[3-carbamoyl-1-(1- methylpiperidin-3-yl)- 1H-pyrazol-4- yl]pyrazolo[1,5- a]pyrimidine-3- carboxamide trifluoroacetate::US10155765, Example 10
SMILES CN1CCCC(C1)n1cc(NC(=O)c2cnn3ccc(N[C@H]4CCCC[C@H]4N)nc23)c(n1)C(N)=O
InChI Key InChIKey=JRTSFXDDIMYUIL-XMKPYSNPSA-N
Data  1 IC50
  Tab Delimited (TSV)   2D SDfile   Computed 3D by Vconf -m prep SDfile
Find this compound or compounds like it in BindingDB:
Activity Spreadsheet -- Enzyme Inhibition Constant Data from BindingDB
Found 1 hit for monomerid = 311524
TargetInterleukin-1 receptor-associated kinase 4(Homo sapiens (Human))
Merck Sharp & Dohme
US Patent
LigandPNGBDBM311524(5-{[cis-2- aminocyclohexyl]amino}- N-[3-carbamoyl-...)
Affinity DataIC50:  25nM. Assay description: The kinase activity of IRAK4 is determined by its ability to catalyze the phosphorylation of a fluorescent polypeptide substrate. The extent of phosp...
Ligand InfoPC cidPC sid
In DepthDetails US Patent