BDBM3119 2-pyridinone deriv. 25::5-ethyl-3-{[(2-methoxypyridin-3-yl)methyl]amino}-6-methyl-1,2-dihydropyridin-2-one
SMILES CCc1cc(NCc2cccnc2OC)c(=O)[nH]c1C
InChI Key InChIKey=QHNARWCYVZEIPA-UHFFFAOYSA-N
Data  1 IC50
  Tab Delimited (TSV)   2D SDfile   Computed 3D by Vconf -m prep SDfile
Find this compound or compounds like it in BindingDB:
Activity Spreadsheet -- Enzyme Inhibition Constant Data from BindingDB
Found 1 hit for monomerid = 3119
TargetGag-Pol polyprotein [588-1027]/[588-1147](Human immunodeficiency virus type 1)
Merck Research Laboratories
LigandPNGBDBM3119(2-pyridinone deriv. 25 | 5-ethyl-3-{[(2-methoxypyr...)
Affinity DataIC50:  680nMpH: 8.2Assay Description:The IC50 of reverse transcriptase is the concentration that inhibits 50% of recombinant HIV-1 RT RNA-directed DNA polymerase activity in vitro.
In DepthDetails ArticlePubMed