BDBM312051 N-{(2R)-3-(7-methyl-1H-indazol-5-yl)-1-oxo-1-[4-(4H-1,2,4-triazol-3-yl)-1,4'-bipiperidin-1'-yl]propan-2-yl}-4-(2-oxo-1,2-dihydroquinolin-3-yl)piperidine-1-carboxamide::US10166226, Example 7
SMILES Cc1cc(C[C@@H](NC(=O)N2CCC(CC2)c2cc3ccccc3[nH]c2=O)C(=O)N2CCC(CC2)N2CCC(CC2)c2nnc[nH]2)cc2cn[nH]c12
InChI Key
Data  1 KI
  Tab Delimited (TSV)   2D SDfile   Computed 3D by Vconf -m prep SDfile
Find this compound or compounds like it in BindingDB:
Activity Spreadsheet -- Enzyme Inhibition Constant Data from BindingDB
Found 1 hit for monomerid = 312051
TargetCalcitonin gene-related peptide 1(Homo sapiens (Human))
Heptares Therapeutics
US Patent
LigandPNGBDBM312051(N-{(2R)-3-(7-methyl-1H-indazol-5-yl)-1-oxo-1-[4-(4...)
Affinity DataKi:  0.158nM. Assay description: Human CGRP receptors (consisting of CRLR and RAMP1) expressed in insect Sf21 cell membrane homogenates were re-suspended in the binding buffer (10 mM...
Ligand InfoPC cidPC sid
In DepthDetails US Patent