BDBM31210 2-phenoxybenzoyltryptophan derivative, R1C4
SMILES OC(=O)[C@H](Cc1cn(Cc2ccc(OCc3ccccc3)cc2)c2cc(Br)ccc12)NC(=O)c1ccccc1Oc1ccccc1
InChI Key InChIKey=SBDSDIMVYOUEEB-UMSFTDKQSA-N
Data  1 KI
  Tab Delimited (TSV)   2D SDfile   Computed 3D by Vconf -m prep SDfile
Find this compound or compounds like it in BindingDB:
Activity Spreadsheet -- Enzyme Inhibition Constant Data from BindingDB
Found 1 hit for monomerid = 31210
TargetE3 ubiquitin-protein ligase Mdm2(Homo sapiens (Human))
Schering-Plough Research Institute
LigandPNGBDBM31210(2-phenoxybenzoyltryptophan derivative, R1C4)
Affinity DataKi:  600nM ΔG°:  -8.43kcal/molepH: 7.4 T: 2°C. Assay description: Ki values were determined from a competition experiment in which serial dilutions of inhibitor were added to compete against a fixed concentration (1...
In DepthDetails ArticlePubMed