BDBM312135 6,8-dihydroxy-2-(4-hydroxyphenyl)-1-oxo-1,2-dihydroisoquinoline-4-carbonitrile::US9604931, 14m
SMILES Oc1ccc(cc1)-n1cc(C#N)c2cc(O)cc(O)c2c1=O
InChI Key InChIKey=VZSCCCSZIQBCNZ-UHFFFAOYSA-N
Data  2 KI
  Tab Delimited (TSV)   2D SDfile   Computed 3D by Vconf -m prep SDfile
Find this compound or compounds like it in BindingDB:
Activity Spreadsheet -- Enzyme Inhibition Constant Data from BindingDB
Found 2 hits for monomerid = 312135
TargetSteroid hormone receptor ERR2(Homo sapiens (Human))
Gtx
US Patent
LigandPNGBDBM312135(6,8-dihydroxy-2-(4-hydroxyphenyl)-1-oxo-1,2-dihydr...)
Affinity DataKi:  7nM. Assay description: Estrogen receptor (ERβ) binding affinity of the NRBAs was also determined using an in vitro competitive radioligand-binding assay with [3H]-estr...
Ligand InfoPC cidPC sid
In DepthDetails US Patent
TargetSteroid hormone receptor ERR1(Homo sapiens (Human))
Gtx
US Patent
LigandPNGBDBM312135(6,8-dihydroxy-2-(4-hydroxyphenyl)-1-oxo-1,2-dihydr...)
Affinity DataKi:  94nM. Assay description: Estrogen receptor (ERβ) binding affinity of the NRBAs was also determined using an in vitro competitive radioligand-binding assay with [3H]-estr...
Ligand InfoPC cidPC sid
In DepthDetails US Patent