BDBM312391 3-[3-(3-Trifluoromethyl-[1,2,4]oxadiazol-5-yl)-5,6-dihydro-4H-cyclopenta[b]thiophen-2-ylcarbamoyl]-bicyclo[2.2.2]oct-2-ene-2-carboxylic acid::US9604977, Example 137
SMILES OC(=O)C1=C(C2CCC1CC2)C(=O)Nc1sc2CCCc2c1-c1nc(no1)C(F)(F)F
InChI Key InChIKey=AVEIGYVJUOVLNL-UHFFFAOYSA-N
Data  2 IC50
  Tab Delimited (TSV)   2D SDfile   Computed 3D by Vconf -m prep SDfile
Find this compound or compounds like it in BindingDB:
Activity Spreadsheet -- Enzyme Inhibition Constant Data from BindingDB
Found 2 hits for monomerid = 312391
TargetFatty acid-binding protein 5(Homo sapiens (Human))
Hoffmann-La Roche
US Patent
LigandPNGBDBM312391(3-[3-(3-Trifluoromethyl-[1,2,4]oxadiazol-5-yl)-5,6...)
Affinity DataIC50:  70nM. Assay description: Compounds were profiled for activity against human FABP4 (huFABP4) and/or human FABP5 (huFABP5) in Terbium (Tb) time resolved-fluorescence energy tra...
Ligand InfoPC cidPC sid
In DepthDetails US Patent
TargetFatty acid-binding protein, adipocyte(Homo sapiens (Human))
Hoffmann-La Roche
US Patent
LigandPNGBDBM312391(3-[3-(3-Trifluoromethyl-[1,2,4]oxadiazol-5-yl)-5,6...)
Affinity DataIC50:  20nM. Assay description: Compounds were profiled for activity against human FABP4 (huFABP4) and/or human FABP5 (huFABP5) in Terbium (Tb) time resolved-fluorescence energy tra...
Ligand InfoPC cidPC sid
In DepthDetails US Patent