BDBM31252 isoindolinone scaffold, 41
SMILES [O-]S(=O)(=O)CCOC1(N(Cc2ccccc2)C(=O)c2ccccc12)c1ccccc1
InChI Key InChIKey=CBNHBFFDFKFSFQ-UHFFFAOYSA-M
Data  1 IC50
  Tab Delimited (TSV)   2D SDfile   Computed 3D by Vconf -m prep SDfile
Find this compound or compounds like it in BindingDB:
Activity Spreadsheet -- Enzyme Inhibition Constant Data from BindingDB
Found 1 hit for monomerid = 31252
TargetE3 ubiquitin-protein ligase Mdm2(Homo sapiens (Human))
University Of Newcastle Upon Tyne
LigandPNGBDBM31252(isoindolinone scaffold, 41)
Affinity DataIC50:  3.45E+5nMpH: 7.4 T: 2°C. Assay description: For initial testing, the compounds and controls were plated out in triplicate into clear 96-well plates (Nunc) in 10 ul aliquots to give final concen...
In DepthDetails ArticlePubMed