BDBM312573 US9604989, Example 59::tert-Butyl {1-[4-(8-acetamido-3-phenylimidazo[1,2-b]pyridazin-2-yl)phenyl]-cyclobutyl}carbamate
SMILES NC(=O)c1ccnn2c(c(nc12)-c1ccc(cc1)C1(N)CCC1)-c1ccccc1
InChI Key InChIKey=ODXGJZWJTXZHFS-UHFFFAOYSA-N
Data  2 IC50
  Tab Delimited (TSV)   2D SDfile   Computed 3D by Vconf -m prep SDfile
Find this compound or compounds like it in BindingDB:
Activity Spreadsheet -- Enzyme Inhibition Constant Data from BindingDB
Found 2 hits for monomerid = 312573
TargetRAC-beta serine/threonine-protein kinase(Homo sapiens (Human))
Bayer Intellectual Property
US Patent
LigandPNGBDBM312573(US9604989, Example 59 | tert-Butyl {1-[4-(8-acetam...)
Affinity DataIC50:  110nM. Assay description: His-tagged human recombinant kinase full-length Akt2 expressed in insect cells and activated by PDK1 was purchased form Invitrogen (part number PV 39...
Ligand InfoPC cidPC sid
In DepthDetails US Patent
TargetRAC-alpha serine/threonine-protein kinase(Homo sapiens (Human))
Bayer Intellectual Property
US Patent
LigandPNGBDBM312573(US9604989, Example 59 | tert-Butyl {1-[4-(8-acetam...)
Affinity DataIC50:  65nM. Assay description: For the assay 50 nl of a 100 fold concentrated solution of the test compound in DMSO was pipetted into a black low volume 384 well microtiter plate (...
Ligand InfoPC cidPC sid
In DepthDetails US Patent