BDBM312610 US9604998, Example 16
SMILES Cc1c(ccc(F)c1[N+]#[C-])[C@@H]1CN2CCN(CC(O)c3ccc(nc3)-n3cnnn3)C[C@H]2CO1
InChI Key InChIKey=VODYWCKYZCCUKX-ZPWCZAOQSA-N
Data  1 IC50
  Tab Delimited (TSV)   2D SDfile   Computed 3D by Vconf -m prep SDfile
Find this compound or compounds like it in BindingDB:
Activity Spreadsheet -- Enzyme Inhibition Constant Data from BindingDB
Found 1 hit for monomerid = 312610
TargetATP-sensitive inward rectifier potassium channel 1(Homo sapiens (Human))
Merck Sharp & Dohme
US Patent
LigandPNGBDBM312610(US9604998, Example 16)
Affinity DataIC50:  80nM. Assay description: Block of Kir1.1 (ROMK1) currents was examined by whole cell voltage clamp (Hamill et. al. Pfluegers Archives 391:85-100 (1981)) using the IonWorks Qu...
Ligand InfoPC cidPC sid
In DepthDetails US Patent