BDBM312652 US9604998, Example 52
SMILES Cc1c2COC(=O)c2ccc1[C@@H](O)CN1CCN2C[C@H](OC[C@@H]2C1)c1cc(F)c([N+]#[C-])c(F)c1
InChI Key InChIKey=CAYXDXYVBRMVGL-GMWOSMDTSA-N
Data  1 IC50
  Tab Delimited (TSV)   2D SDfile   Computed 3D by Vconf -m prep SDfile
Find this compound or compounds like it in BindingDB:
Activity Spreadsheet -- Enzyme Inhibition Constant Data from BindingDB
Found 1 hit for monomerid = 312652
TargetATP-sensitive inward rectifier potassium channel 1(Homo sapiens (Human))
Merck Sharp & Dohme
US Patent
LigandPNGBDBM312652(US9604998, Example 52)
Affinity DataIC50:  100nM. Assay description: Block of Kir1.1 (ROMK1) currents was examined by whole cell voltage clamp (Hamill et. al. Pfluegers Archives 391:85-100 (1981)) using the IonWorks Qu...
Ligand InfoPC cidPC sid
In DepthDetails US Patent