BDBM312704 US9604998, Example 103
SMILES Cc1c(ccc(F)c1[N+]#[C-])[C@@H]1CN2CCN(CCc3ccc4C(=O)OCc4c3)C[C@H]2CN1
InChI Key InChIKey=QNEVJOZRAUDJDK-XXBNENTESA-N
Data  1 IC50
  Tab Delimited (TSV)   2D SDfile   Computed 3D by Vconf -m prep SDfile
Find this compound or compounds like it in BindingDB:
Activity Spreadsheet -- Enzyme Inhibition Constant Data from BindingDB
Found 1 hit for monomerid = 312704
TargetATP-sensitive inward rectifier potassium channel 1(Homo sapiens (Human))
Merck Sharp & Dohme
US Patent
LigandPNGBDBM312704(US9604998, Example 103)
Affinity DataIC50:  60nM. Assay description: Block of Kir1.1 (ROMK1) currents was examined by whole cell voltage clamp (Hamill et. al. Pfluegers Archives 391:85-100 (1981)) using the IonWorks Qu...
Ligand InfoPC cidPC sid
In DepthDetails US Patent