BDBM312859 1-[3-[2-[(3R)-3-hydroxy-1- methyl-2-oxo-pyrrolidin-3- yl]ethynyl]phenyl]-5-methyl- pyrazolo[3,4-c]pyridine-3- carboxamide::US9605005, Example 149
SMILES CN1CC[C@@](O)(C#Cc2cccc(c2)-n2nc(C(N)=O)c3cc(C)ncc23)C1=O
InChI Key InChIKey=UKSNFJIACOQIBM-NRFANRHFSA-N
Data  1 KI
  Tab Delimited (TSV)   2D SDfile   Computed 3D by Vconf -m prep SDfile
Find this compound or compounds like it in BindingDB:
Activity Spreadsheet -- Enzyme Inhibition Constant Data from BindingDB
Found 1 hit for monomerid = 312859
TargetInhibitor of nuclear factor kappa-B kinase subunit beta(Homo sapiens (Human))
Genentech
US Patent
LigandPNGBDBM312859(1-[3-[2-[(3R)-3-hydroxy-1- methyl-2-oxo-pyrrolidin...)
Affinity DataKi:  1.08nM. Assay description: The ability of the nuclear factor-kappa B (NF-kB)-inducing kinase (NIK) to catalyze the hydrolysis of adenosine-5′-triphosphate (ATP) was monit...
Ligand InfoPC cidPC sid
In DepthDetails US Patent