BDBM312955 3-[1-(3-Chloro-2-fluorobenzyl)-6-methyl-1H-pyrazolo[3,4-b]pyridin-3-yl]-7,7-dimethyl-5,7-dihydro-6H-pyrrolo[2,3-e][1,2,4]triazin-6-one::US9605008, 14
SMILES Cc1ccc2c(nn(Cc3cccc(Cl)c3F)c2n1)-c1nnc2c(NC(=O)C2(C)C)n1
InChI Key InChIKey=SYYWHHJURBQVMH-UHFFFAOYSA-N
Data  1 IC50
  Tab Delimited (TSV)   2D SDfile   Computed 3D by Vconf -m prep SDfile
Find this compound or compounds like it in BindingDB:
Activity Spreadsheet -- Enzyme Inhibition Constant Data from BindingDB
Found 1 hit for monomerid = 312955
TargetcGMP-specific 3',5'-cyclic phosphodiesterase(Homo sapiens (Human))
Bayer Pharma Aktiengesellschaft
US Patent
LigandPNGBDBM312955(3-[1-(3-Chloro-2-fluorobenzyl)-6-methyl-1H-pyrazol...)
Affinity DataIC50:  63nM. Assay description: To determine their in vitro action on human PDE 5, the test substances are dissolved in 100% DMSO and serially diluted. Typically, dilution series (1...
Ligand InfoPC cidPC sid
In DepthDetails US Patent