BDBM312971 US9605022, Example 6
SMILES CN[C@@H](C)C(=O)N[C@H](C(=O)N1CC[C@@H]2[C@H]1C(=O)N[C@@H](Cc1ccc3ccccc3c1)C(=O)N[C@@H](Cc1ccc(OCc3cn(nn3)[C@@H]3CCN([C@@H]3C(=O)N[C@@H](Cc3ccc4ccccc4c3)C(=O)N[C@@H](Cc3ccc(OCc4cn2nn4)cc3)C(=O)OC)C(=O)[C@@H](NC(=O)[C@H](C)NC)C(C)(C)C)cc1)C(=O)NS(=O)(=O)C1CC1)C(C)(C)C
InChI Key InChIKey=GUYDSOLIABCZFM-OEKHCWRBSA-N
Data  2 IC50
  Tab Delimited (TSV)   2D SDfile   Computed 3D by Vconf -m prep SDfile
Find this compound or compounds like it in BindingDB:
Activity Spreadsheet -- Enzyme Inhibition Constant Data from BindingDB
Found 2 hits for monomerid = 312971
TargetBaculoviral IAP repeat-containing protein 2/E3 ubiquitin-protein ligase XIAP(Homo sapiens (Human))
Ensemble Therapeutics
US Patent
LigandPNGBDBM312971(US9605022, Example 6)
Affinity DataIC50:  2.40nM. Assay description: Assays were performed in black, flat-bottom, 384-well plates. The final assay volume was 50 μL prepared from additions of His-BIR2-3 (125-356, C...
Ligand InfoPC cidPC sid
In DepthDetails US Patent
TargetBaculoviral IAP repeat-containing protein 3/E3 ubiquitin-protein ligase XIAP(Homo sapiens (Human))
Ensemble Therapeutics
US Patent
LigandPNGBDBM312971(US9605022, Example 6)
Affinity DataIC50:  14.6nM. Assay description: Assays were performed in black, flat-bottom, 384-well plates. The final assay volume was 50 μL prepared from additions of His-BIR3 (241-356, XIA...
Ligand InfoPC cidPC sid
In DepthDetails US Patent