BDBM313094 1-(7-tert-butyl-5,6,7,8-tetrahydrobenzo[4,5]thieno[2,3-d]pyrimidin-4-yl)-N3-(4-(2-(pyrrolidin-1-yl)ethoxy)phenyl)-1H-1,2,4-triazole-3,5-diamine::US10166216, Compound 73
SMILES CC(C)(C)C1CCc2c(C1)sc1ncnc(-n3nc(Nc4ccc(OCCN5CCCC5)cc4)nc3N)c21
InChI Key InChIKey=WZVPSAPBKNJHNU-UHFFFAOYSA-N
Data  1 IC50
  Tab Delimited (TSV)   2D SDfile   Computed 3D by Vconf -m prep SDfile
Find this compound or compounds like it in BindingDB:
Activity Spreadsheet -- Enzyme Inhibition Constant Data from BindingDB
Found 1 hit for monomerid = 313094
TargetTyrosine-protein kinase receptor UFO(Homo sapiens (Human))
Rigel Pharmaceuticals
US Patent
LigandPNGBDBM313094(1-(7-tert-butyl-5,6,7,8-tetrahydrobenzo[4,5]thieno...)
Affinity DataIC50:  5.50E+3nM. Assay description: The resulting chemiluminescence was read with a Luminomitor within 10 minutes to minimize changes in signal intensity. After reading the chemilumines...
Ligand InfoPC cidPC sid
In DepthDetails US Patent