BDBM313103 1-(2,6-dichlorothieno[3,2-d]pyrimidin-4-yl)-N3-(4-(2-pyrrolidin-1-ylethoxy)phenyl)-1H-1,2,4-triazole-3,5-diamine::US10166216, Compound 175
SMILES Nc1nc(Nc2ccc(OCCN3CCCC3)cc2)nn1-c1nc(Cl)nc2cc(Cl)sc12
InChI Key InChIKey=YZZRPQWQECDEQR-UHFFFAOYSA-N
Data  1 IC50
  Tab Delimited (TSV)   2D SDfile   Computed 3D by Vconf -m prep SDfile
Find this compound or compounds like it in BindingDB:
Activity Spreadsheet -- Enzyme Inhibition Constant Data from BindingDB
Found 1 hit for monomerid = 313103
TargetTyrosine-protein kinase receptor UFO(Homo sapiens (Human))
Rigel Pharmaceuticals
US Patent
LigandPNGBDBM313103(1-(2,6-dichlorothieno[3,2-d]pyrimidin-4-yl)-N3-(4-...)
Affinity DataIC50: <1.00E+3nM. Assay description: The resulting chemiluminescence was read with a Luminomitor within 10 minutes to minimize changes in signal intensity. After reading the chemilumines...
Ligand InfoPC cidPC sid
In DepthDetails US Patent