BDBM313116 1-(4-(5-amino-1-(quinoxalin-2-yl)-1H-1,2,4-triazol-3-ylamino)phenyl)ethanone::US10166216, Compound 144
SMILES CC(=O)c1ccc(Nc2nc(N)n(n2)-c2cnc3ccccc3n2)cc1
InChI Key InChIKey=ALRWDRXVQJUCEM-UHFFFAOYSA-N
Data  1 IC50
  Tab Delimited (TSV)   2D SDfile   Computed 3D by Vconf -m prep SDfile
Find this compound or compounds like it in BindingDB:
Activity Spreadsheet -- Enzyme Inhibition Constant Data from BindingDB
Found 1 hit for monomerid = 313116
TargetTyrosine-protein kinase receptor UFO(Homo sapiens (Human))
Rigel Pharmaceuticals
US Patent
LigandPNGBDBM313116(1-(4-(5-amino-1-(quinoxalin-2-yl)-1H-1,2,4-triazol...)
Affinity DataIC50: >2.00E+4nM. Assay description: The resulting chemiluminescence was read with a Luminomitor within 10 minutes to minimize changes in signal intensity. After reading the chemilumines...
Ligand InfoPC cidPC sid
In DepthDetails US Patent