BDBM313133 N3-(4-((R)-3-(dimethylamino) pyrrolidin-1-yl)phenyl)-1-(isoquinolin-1-yl)-1H-1,2,4-triazole-3,5-diamine::US10166216, Compound 164
SMILES CN(C)[C@@H]1CCN(C1)c1ccc(Nc2nc(N)n(n2)-c2nccc3ccccc23)cc1
InChI Key InChIKey=HYAIEPBPRAKFRU-LJQANCHMSA-N
Data  1 IC50
  Tab Delimited (TSV)   2D SDfile   Computed 3D by Vconf -m prep SDfile
Find this compound or compounds like it in BindingDB:
Activity Spreadsheet -- Enzyme Inhibition Constant Data from BindingDB
Found 1 hit for monomerid = 313133
TargetTyrosine-protein kinase receptor UFO(Homo sapiens (Human))
Rigel Pharmaceuticals
US Patent
LigandPNGBDBM313133(N3-(4-((R)-3-(dimethylamino) pyrrolidin-1-yl)pheny...)
Affinity DataIC50: <1.00E+3nM. Assay description: The resulting chemiluminescence was read with a Luminomitor within 10 minutes to minimize changes in signal intensity. After reading the chemilumines...
Ligand InfoPC cidPC sid
In DepthDetails US Patent