BDBM313139 1-(5,6-dihydrobenzo[h] cinnolin-3-yl)-N3-(3-fluoro-4-(4-(pyrrolidin-1-yl)piperidin-1-yl)phenyl)-1H-1,2,4-triazole-3,5-diamine::US10166216, Compound 170
SMILES Nc1nc(Nc2ccc(N3CCC(CC3)N3CCCC3)c(F)c2)nn1-c1cc2CCc3ccccc3-c2nn1
InChI Key InChIKey=GJWJVDPUOLLAGS-UHFFFAOYSA-N
Data  1 IC50
  Tab Delimited (TSV)   2D SDfile   Computed 3D by Vconf -m prep SDfile
Find this compound or compounds like it in BindingDB:
Activity Spreadsheet -- Enzyme Inhibition Constant Data from BindingDB
Found 1 hit for monomerid = 313139
TargetTyrosine-protein kinase receptor UFO(Homo sapiens (Human))
Rigel Pharmaceuticals
US Patent
LigandPNGBDBM313139(1-(5,6-dihydrobenzo[h] cinnolin-3-yl)-N3-(3-fluoro...)
Affinity DataIC50:  5.50E+3nM. Assay description: The resulting chemiluminescence was read with a Luminomitor within 10 minutes to minimize changes in signal intensity. After reading the chemilumines...
Ligand InfoPC cidPC sid
In DepthDetails US Patent