BDBM313143 1-(6,7-dimethoxyisoquinolin-1-yl)-N3-(4-(1-methylpiperidin-4-yl)phenyl)-1H-1,2,4-triazole-3,5-diamine::US10166216, Compound 174
SMILES COc1cc2ccnc(-n3nc(Nc4ccc(cc4)C4CCN(C)CC4)nc3N)c2cc1OC
InChI Key InChIKey=GPXFXIPLOWXYJZ-UHFFFAOYSA-N
Data  1 IC50
  Tab Delimited (TSV)   2D SDfile   Computed 3D by Vconf -m prep SDfile
Find this compound or compounds like it in BindingDB:
Activity Spreadsheet -- Enzyme Inhibition Constant Data from BindingDB
Found 1 hit for monomerid = 313143
TargetTyrosine-protein kinase receptor UFO(Homo sapiens (Human))
Rigel Pharmaceuticals
US Patent
LigandPNGBDBM313143(1-(6,7-dimethoxyisoquinolin-1-yl)-N3-(4-(1-methylp...)
Affinity DataIC50: <1.00E+3nM. Assay description: The resulting chemiluminescence was read with a Luminomitor within 10 minutes to minimize changes in signal intensity. After reading the chemilumines...
Ligand InfoPC cidPC sid
In DepthDetails US Patent