BDBM313165 1-(6,7-dimethoxyquinazolin-4-yl)-N5-(4-(1-methylpiperidin-3-yloxy)phenyl)-1H-1,2,4-triazole-3,5-diamine::US10166216, Compound 154
SMILES COc1cc2ncnc(-n3nc(N)nc3Nc3ccc(OC4CCCN(C)C4)cc3)c2cc1OC
InChI Key InChIKey=GTDMKMBRWAAIBZ-UHFFFAOYSA-N
Data  1 IC50
  Tab Delimited (TSV)   2D SDfile   Computed 3D by Vconf -m prep SDfile
Find this compound or compounds like it in BindingDB:
Activity Spreadsheet -- Enzyme Inhibition Constant Data from BindingDB
Found 1 hit for monomerid = 313165
TargetTyrosine-protein kinase receptor UFO(Homo sapiens (Human))
Rigel Pharmaceuticals
US Patent
LigandPNGBDBM313165(1-(6,7-dimethoxyquinazolin-4-yl)-N5-(4-(1-methylpi...)
Affinity DataIC50:  5.50E+3nM. Assay description: The resulting chemiluminescence was read with a Luminomitor within 10 minutes to minimize changes in signal intensity. After reading the chemilumines...
Ligand InfoPC cidPC sid
In DepthDetails US Patent