BDBM313173 1-(7-methyl-2-chlorothieno[3,2-d] pyrimidin-4-yl)-N3-(8-(2-diethylaminoethyl)-9-hydroxy-6,7,8,9-tetrahydro-5H-benzo [7]annulene-2-yl)-1H-1,2,4-triazole-3,5-diamine::US10166216, Compound 263
SMILES CCN(CC)CCC1CCCc2ccc(Nc3nc(N)n(n3)-c3nc(Cl)nc4c(C)csc34)cc2C1O
InChI Key InChIKey=SOUGOLFJBNCSPX-UHFFFAOYSA-N
Data  1 IC50
  Tab Delimited (TSV)   2D SDfile   Computed 3D by Vconf -m prep SDfile
Find this compound or compounds like it in BindingDB:
Activity Spreadsheet -- Enzyme Inhibition Constant Data from BindingDB
Found 1 hit for monomerid = 313173
TargetTyrosine-protein kinase receptor UFO(Homo sapiens (Human))
Rigel Pharmaceuticals
US Patent
LigandPNGBDBM313173(1-(7-methyl-2-chlorothieno[3,2-d] pyrimidin-4-yl)-...)
Affinity DataIC50:  5.50E+3nM. Assay description: The resulting chemiluminescence was read with a Luminomitor within 10 minutes to minimize changes in signal intensity. After reading the chemilumines...
Ligand InfoPC cidPC sid
In DepthDetails US Patent