BDBM313208 1-(4-cyclopropylphenyl)-N-(1-ethyl-4-methyl-2-oxo-3,4-dihydroquinolin-6-yl)methanesulfonamide::US10167261, Compound 1.178
SMILES CCN1C(=O)CC(C)c2cc(NS(=O)(=O)Cc3ccc(cc3)C3CC3)ccc12
InChI Key InChIKey=QHJABGCRHLVGHJ-UHFFFAOYSA-N
Data  4 IC50
  Tab Delimited (TSV)   2D SDfile   Computed 3D by Vconf -m prep SDfile
Find this compound or compounds like it in BindingDB:
Activity Spreadsheet -- Enzyme Inhibition Constant Data from BindingDB
Found 4 hits for monomerid = 313208
TargetAbscisic acid receptor PYL1/Protein phosphatase 2C 16(Arabidopsis thaliana (Mouse-ear cress))
University Of California
US Patent
LigandPNGBDBM313208(1-(4-cyclopropylphenyl)-N-(1-ethyl-4-methyl-2-oxo-...)
Affinity DataIC50:  200nM. Assay description: HAB1 and PYL proteins were expressed and purified as described in Park et al. ((2009) Science 324(5930):1068-1071), with minor modifications. To obta...
Ligand InfoPC cidPC sid
In DepthDetails US Patent
TargetAbscisic acid receptor PYL2/Protein phosphatase 2C 16(Arabidopsis thaliana (Mouse-ear cress))
University Of California
US Patent
LigandPNGBDBM313208(1-(4-cyclopropylphenyl)-N-(1-ethyl-4-methyl-2-oxo-...)
Affinity DataIC50:  101nM. Assay description: HAB1 and PYL proteins were expressed and purified as described in Park et al. ((2009) Science 324(5930):1068-1071), with minor modifications. To obta...
Ligand InfoPC cidPC sid
In DepthDetails US Patent
TargetAbscisic acid receptor PYL1/Protein phosphatase 2C 16(Arabidopsis thaliana (Mouse-ear cress))
University Of California
US Patent
LigandPNGBDBM313208(1-(4-cyclopropylphenyl)-N-(1-ethyl-4-methyl-2-oxo-...)
Affinity DataIC50:  200nM. Assay description: HAB1 and PYL proteins were expressed and purified as described in Park et al. ((2009) Science 324(5930):1068-1071), with minor modifications. To obta...
Ligand InfoPC cidPC sid
In DepthDetails US Patent
TargetAbscisic acid receptor PYL2/Protein phosphatase 2C 16(Arabidopsis thaliana (Mouse-ear cress))
University Of California
US Patent
LigandPNGBDBM313208(1-(4-cyclopropylphenyl)-N-(1-ethyl-4-methyl-2-oxo-...)
Affinity DataIC50:  101nM. Assay description: HAB1 and PYL proteins were expressed and purified as described in Park et al. ((2009) Science 324(5930):1068-1071), with minor modifications. To obta...
Ligand InfoPC cidPC sid
In DepthDetails US Patent