BDBM31342 2-(4-Furan-2-ylmethyl-5-pyridin-3-yl-4H-[1,2,4]triazol-3-ylsulfanyl)-1-phenothiazin-10-yl-ethanone::2-[[4-(2-furanylmethyl)-5-(3-pyridinyl)-1,2,4-triazol-3-yl]thio]-1-(10-phenothiazinyl)ethanone::2-[[4-(2-furfuryl)-5-(3-pyridyl)-1,2,4-triazol-3-yl]thio]-1-phenothiazin-10-yl-ethanone::2-[[4-(furan-2-ylmethyl)-5-pyridin-3-yl-1,2,4-triazol-3-yl]sulfanyl]-1-phenothiazin-10-yl-ethanone::2-[[4-(furan-2-ylmethyl)-5-pyridin-3-yl-1,2,4-triazol-3-yl]sulfanyl]-1-phenothiazin-10-ylethanone::MLS000035748::SMR000002527::cid_647617
SMILES O=C(CSc1nnc(-c2cccnc2)n1Cc1ccco1)N1c2ccccc2Sc2ccccc12
InChI Key InChIKey=PCYOICASRCTHMC-UHFFFAOYSA-N
Data  3 IC50
  Tab Delimited (TSV)   2D SDfile   Computed 3D by Vconf -m prep SDfile
Find this compound or compounds like it in BindingDB:
Activity Spreadsheet -- Enzyme Inhibition Constant Data from BindingDB
Found 3 hits for monomerid = 31342
Target5-hydroxytryptamine receptor 1E(Homo sapiens (Human))
The Scripps Research Institute Molecular Screening Center
Curated by PubChem BioAssay
LigandPNGBDBM31342(2-(4-Furan-2-ylmethyl-5-pyridin-3-yl-4H-[1,2,4]tri...)
Affinity DataIC50:  5.00E+4nMpH: 7.4 T: 2°C. Assay description: The CHO cell line was cultured in T-175 flasks at 37 degrees C and 95% relative humidity (RH). The growth media consisted of Dulbecco's Modified ...
In DepthDetails PCBioAssay
TargetSphingosine 1-phosphate receptor 3(Homo sapiens (Human))
The Scripps Research Institute Molecular Screening Center
Curated by PubChem BioAssay
LigandPNGBDBM31342(2-(4-Furan-2-ylmethyl-5-pyridin-3-yl-4H-[1,2,4]tri...)
Affinity DataIC50: >5.00E+4nM. Assay description: Source (MLPCN Center Name): The Scripps Research Institute Molecular Screening Center (SRIMSC) Center Affiliation: The Scripps Research Institute (TS...
In DepthDetails PCBioAssay
TargetSphingosine 1-phosphate receptor 3(Homo sapiens (Human))
The Scripps Research Institute Molecular Screening Center
Curated by PubChem BioAssay
LigandPNGBDBM31342(2-(4-Furan-2-ylmethyl-5-pyridin-3-yl-4H-[1,2,4]tri...)
Affinity DataIC50: >4.98E+4nM. Assay description: Source (MLSCN Center Name): The Scripps Research Institute Molecular Screening Center Center Affiliation: The Scripps Research Institute, TSRI Assay ...
In DepthDetails PCBioAssay