BDBM313437 US10167270, Example 134
SMILES CN(CCOc1ccccc1)c1nc(nc2ccccc12)-c1ccoc1
InChI Key InChIKey=OEDJYSNEHYQMML-UHFFFAOYSA-N
Data  1 IC50
  Tab Delimited (TSV)   2D SDfile   Computed 3D by Vconf -m prep SDfile
Find this compound or compounds like it in BindingDB:
Activity Spreadsheet -- Enzyme Inhibition Constant Data from BindingDB
Found 1 hit for monomerid = 313437
TargetLysosomal acid glucosylceramidase(Homo sapiens (Human))
Northwestern University
US Patent
LigandPNGBDBM313437(US10167270, Example 134)
Affinity DataIC50:  650nM. Assay description: The enzyme in GCase enzyme activity buffer (25 μL/well) was added to a 384-well black plate. The fluorescent probe 3 (25 nL/well, 50 nM final co...
Ligand InfoPC cidPC sid
In DepthDetails US Patent