BDBM31360 4-fluorobenzoic acid [2-(3-chloro-4-methyl-anilino)-2-keto-1-phenyl-ethyl] ester::4-fluorobenzoic acid [2-(3-chloro-4-methylanilino)-2-oxo-1-phenylethyl] ester::MLS000417197::SMR000264393::[2-(3-chloro-4-methylanilino)-2-oxo-1-phenylethyl] 4-fluorobenzoate::[2-[(3-chloranyl-4-methyl-phenyl)amino]-2-oxidanylidene-1-phenyl-ethyl] 4-fluoranylbenzoate::cid_4841482
SMILES Cc1ccc(NC(=O)C(OC(=O)c2ccc(F)cc2)c2ccccc2)cc1Cl
InChI Key InChIKey=ROHFHHQBSHILLN-UHFFFAOYSA-N
Data  2 IC50
  Tab Delimited (TSV)   2D SDfile   Computed 3D by Vconf -m prep SDfile
Find this compound or compounds like it in BindingDB:
Activity Spreadsheet -- Enzyme Inhibition Constant Data from BindingDB
Found 2 hits for monomerid = 31360
TargetSphingosine 1-phosphate receptor 3(Homo sapiens (Human))
The Scripps Research Institute Molecular Screening Center
Curated by PubChem BioAssay
LigandPNGBDBM31360(4-fluorobenzoic acid [2-(3-chloro-4-methyl-anilino...)
Affinity DataIC50:  6.41E+3nM. Assay description: Source (MLPCN Center Name): The Scripps Research Institute Molecular Screening Center (SRIMSC) Center Affiliation: The Scripps Research Institute (TS...
In DepthDetails PCBioAssay
Target5-hydroxytryptamine receptor 1E(Homo sapiens (Human))
The Scripps Research Institute Molecular Screening Center
Curated by PubChem BioAssay
LigandPNGBDBM31360(4-fluorobenzoic acid [2-(3-chloro-4-methyl-anilino...)
Affinity DataIC50:  1.57E+4nMpH: 7.4 T: 2°C. Assay description: The CHO cell line was cultured in T-175 flasks at 37 degrees C and 95% relative humidity (RH). The growth media consisted of Dulbecco's Modified ...
In DepthDetails PCBioAssay