BDBM313728 5-({2-[4-(2-Cyano-5-methylphenyl)-5-methoxy-2-oxopyridin-1(2H)-yl]-4-methoxybutanoyl}amino)pyridine-2-carboxamide (racemate)::US10167280, Example 33::US10167280, Example 34
SMILES COCCC(C(=O)Nc1ccc(nc1)C(N)=O)n1cc(OC)c(cc1=O)-c1cc(C)ccc1C#N
InChI Key InChIKey=WAJGYLYYFFQRIF-UHFFFAOYSA-N
Data  4 IC50
  Tab Delimited (TSV)   2D SDfile   Computed 3D by Vconf -m prep SDfile
Find this compound or compounds like it in BindingDB:
Activity Spreadsheet -- Enzyme Inhibition Constant Data from BindingDB
Found 4 hits for monomerid = 313728
TargetCoagulation factor XI(Homo sapiens (Human))
Bayer Pharma Aktiengesellschaft
US Patent
LigandPNGBDBM313728(5-({2-[4-(2-Cyano-5-methylphenyl)-5-methoxy-2-oxop...)
Affinity DataIC50:  32nM. Assay description: The factor XIa inhibition of the substances according to the invention is determined using a biochemical test system which utilizes the reaction of a...
Ligand InfoPC cidPC sid
In DepthDetails US Patent
TargetCoagulation factor XI(Homo sapiens (Human))
Bayer Pharma Aktiengesellschaft
US Patent
LigandPNGBDBM313728(5-({2-[4-(2-Cyano-5-methylphenyl)-5-methoxy-2-oxop...)
Affinity DataIC50:  19nM. Assay description: The factor XIa inhibition of the substances according to the invention is determined using a biochemical test system which utilizes the reaction of a...
Ligand InfoPC cidPC sid
In DepthDetails US Patent
TargetCoagulation factor XI(Homo sapiens (Human))
Bayer Pharma Aktiengesellschaft
US Patent
LigandPNGBDBM313728(5-({2-[4-(2-Cyano-5-methylphenyl)-5-methoxy-2-oxop...)
Affinity DataIC50:  39nM. Assay description: The factor XIa inhibition of the substances according to the invention is determined using a biochemical test system which utilizes the reaction of a...
Ligand InfoPC cidPC sid
In DepthDetails US Patent
TargetCoagulation factor XI(Homo sapiens (Human))
Bayer Pharma Aktiengesellschaft
US Patent
LigandPNGBDBM313728(5-({2-[4-(2-Cyano-5-methylphenyl)-5-methoxy-2-oxop...)
Affinity DataIC50:  14nM. Assay description: The factor XIa inhibition of the substances according to the invention is determined using a biochemical test system which utilizes the reaction of a...
Ligand InfoPC cidPC sid
In DepthDetails US Patent