BDBM313805 US10167292, Example 49
SMILES Cc1nnn2CCN(c3ccc(Cl)cc3)c3cc(ccc3-c12)-c1noc(=O)[nH]1
InChI Key InChIKey=RWASQXNBTOFRDF-UHFFFAOYSA-N
Data  4 IC50
  Tab Delimited (TSV)   2D SDfile   Computed 3D by Vconf -m prep SDfile
Find this compound or compounds like it in BindingDB:
Activity Spreadsheet -- Enzyme Inhibition Constant Data from BindingDB
Found 4 hits for monomerid = 313805
TargetBromodomain-containing protein 2 [91-163](Homo sapiens (Human))
Catalyst Therapeutics
US Patent
LigandPNGBDBM313805(US10167292, Example 49)
Affinity DataIC50: <100nM. Assay description: BRD binding and inhibition was assessed by measuring the interaction of biotinylated acetyl-histone H4 peptide (Anaspec #64989) with the BRD target p...
Ligand InfoPC cidPC sid
In DepthDetails US Patent
TargetBromodomain-containing protein 4 [368-440](Homo sapiens (Human))
Catalyst Therapeutics
US Patent
LigandPNGBDBM313805(US10167292, Example 49)
Affinity DataIC50: <100nM. Assay description: BRD binding and inhibition was assessed by measuring the interaction of biotinylated acetyl-histone H4 peptide (Anaspec #64989) with the BRD target p...
Ligand InfoPC cidPC sid
In DepthDetails US Patent
TargetBromodomain-containing protein 4 [75-147](Homo sapiens (Human))
Catalyst Therapeutics
US Patent
LigandPNGBDBM313805(US10167292, Example 49)
Affinity DataIC50: <100nM. Assay description: BRD binding and inhibition was assessed by measuring the interaction of biotinylated acetyl-histone H4 peptide (Anaspec #64989) with the BRD target p...
Ligand InfoPC cidPC sid
In DepthDetails US Patent
TargetBromodomain-containing protein 2 [364-436](Homo sapiens (Human))
Catalyst Therapeutics
US Patent
LigandPNGBDBM313805(US10167292, Example 49)
Affinity DataIC50: <100nM. Assay description: BRD binding and inhibition was assessed by measuring the interaction of biotinylated acetyl-histone H4 peptide (Anaspec #64989) with the BRD target p...
Ligand InfoPC cidPC sid
In DepthDetails US Patent