BDBM313840 US10167293, Example 33
SMILES FC(F)(F)Oc1cccc(c1)S(=O)(=O)N1C2CCC1CN(C2)C(=O)c1cnn[nH]1
InChI Key
Data  1 IC50
  Tab Delimited (TSV)   2D SDfile   Computed 3D by Vconf -m prep SDfile
Find this compound or compounds like it in BindingDB:
Activity Spreadsheet -- Enzyme Inhibition Constant Data from BindingDB
Found 1 hit for monomerid = 313840
TargetAldo-keto reductase family 1 member C3(Homo sapiens (Human))
Bayer Pharma Aktiengesellschaft
US Patent
LigandPNGBDBM313840(US10167293, Example 33)
Affinity DataIC50:  1.80nM. Assay description: The enzyme used was recombinant human AKR1C3 (Aldo-keto reductase family 1 member C3; GenBank Accession No. NM_003739). This was expressed in E. coli...
Ligand InfoPC cidPC sid
In DepthDetails US Patent