BDBM31388 terephthalamide scaffold, 35
SMILES CC(C)Oc1cc(ccc1C(=O)N[C@@H](Cc1ccccc1)C(O)=O)C(=O)N(C)C
InChI Key InChIKey=QBRQFIWZRIJTJG-SFHVURJKSA-N
Data  1 KI
  Tab Delimited (TSV)   2D SDfile   Computed 3D by Vconf -m prep SDfile
Find this compound or compounds like it in BindingDB:
Activity Spreadsheet -- Enzyme Inhibition Constant Data from BindingDB
Found 1 hit for monomerid = 31388
TargetBcl-2-like protein 1(Homo sapiens (Human))
Yale University
LigandPNGBDBM31388(terephthalamide scaffold, 35)
Affinity DataKi:  8.92E+3nM ΔG°:  -6.88kcal/molepH: 7.4 T: 2°C. Assay description: Fluorescence polarization experiments were conducted on a Photon Technology International instrument using a 0.3 cm path length cuvette. Spectra were...
In DepthDetails ArticlePubMed