BDBM313889 US10167296, Example 1.04
SMILES C[C@@H](Oc1cc(F)ccc1Nc1ncnc2cc(N=S(C)(C)=O)c(OCCN3CCOCC3)c(C)c12)C(F)(F)F
InChI Key InChIKey=GCTSUMNXRDRJFU-QGZVFWFLSA-N
Data  1 IC50
  Tab Delimited (TSV)   2D SDfile   Computed 3D by Vconf -m prep SDfile
Find this compound or compounds like it in BindingDB:
Activity Spreadsheet -- Enzyme Inhibition Constant Data from BindingDB
Found 1 hit for monomerid = 313889
TargetMAP kinase-interacting serine/threonine-protein kinase 2(Homo sapiens (Human))
Evotec International
US Patent
LigandPNGBDBM313889(US10167296, Example 1.04)
Affinity DataIC50:  2.40nM. Assay description: The inhibition of kinase activity of MNK2a was assessed using pre-activated GST-MNK2a. The white, 384-well OptiPlate F plates were purchased from Per...
Ligand InfoPC cidPC sid
In DepthDetails US Patent