BDBM313916 US10167296, Example 2.27
SMILES COc1c(C)c2c(Nc3cc4cn[nH]c4cc3OC(C)C)ncnc2cc1N=S1(=O)CCC1
InChI Key InChIKey=JFZYWAILFVBGGL-UHFFFAOYSA-N
Data  2 IC50
  Tab Delimited (TSV)   2D SDfile   Computed 3D by Vconf -m prep SDfile
Find this compound or compounds like it in BindingDB:
Activity Spreadsheet -- Enzyme Inhibition Constant Data from BindingDB
Found 2 hits for monomerid = 313916
TargetMAP kinase-interacting serine/threonine-protein kinase 1(Homo sapiens (Human))
Evotec International
US Patent
LigandPNGBDBM313916(US10167296, Example 2.27)
Affinity DataIC50:  87nM. Assay description: The Z′-LYTEŽ biochemical assay employs a fluorescence-based, coupled-enzyme format and is based on the differential sensitivity of phosphorylat...
Ligand InfoPC cidPC sid
In DepthDetails US Patent
TargetMAP kinase-interacting serine/threonine-protein kinase 2(Homo sapiens (Human))
Evotec International
US Patent
LigandPNGBDBM313916(US10167296, Example 2.27)
Affinity DataIC50:  3.90nM. Assay description: The inhibition of kinase activity of MNK2a was assessed using pre-activated GST-MNK2a. The white, 384-well OptiPlate F plates were purchased from Per...
Ligand InfoPC cidPC sid
In DepthDetails US Patent