BDBM313946 US10167296, Example 2.57
SMILES COc1c(C)c2c(Nc3ccc(F)cc3O[C@H]3CCOC3)ncnc2cc1N=S1(=O)CCC1
InChI Key InChIKey=YRDRYCRFGSQZQW-INIZCTEOSA-N
Data  2 IC50
  Tab Delimited (TSV)   2D SDfile   Computed 3D by Vconf -m prep SDfile
Find this compound or compounds like it in BindingDB:
Activity Spreadsheet -- Enzyme Inhibition Constant Data from BindingDB
Found 2 hits for monomerid = 313946
TargetMAP kinase-interacting serine/threonine-protein kinase 1(Homo sapiens (Human))
Evotec International
US Patent
LigandPNGBDBM313946(US10167296, Example 2.57)
Affinity DataIC50:  22nM. Assay description: The Z′-LYTEŽ biochemical assay employs a fluorescence-based, coupled-enzyme format and is based on the differential sensitivity of phosphorylat...
Ligand InfoPC cidPC sid
In DepthDetails US Patent
TargetMAP kinase-interacting serine/threonine-protein kinase 2(Homo sapiens (Human))
Evotec International
US Patent
LigandPNGBDBM313946(US10167296, Example 2.57)
Affinity DataIC50:  1.10nM. Assay description: The inhibition of kinase activity of MNK2a was assessed using pre-activated GST-MNK2a. The white, 384-well OptiPlate F plates were purchased from Per...
Ligand InfoPC cidPC sid
In DepthDetails US Patent