BDBM314033 US10167299, Example 147
SMILES CC(C)c1nnc(C)n1C1CC2CCC(C1)N2CC[C@H](NC(=O)C1CCN(CC1)S(C)(=O)=O)c1ccc(C)s1
InChI Key InChIKey=DNEBYUITDMGYTI-DGGBHQDZSA-N
Data  1 IC50
  Tab Delimited (TSV)   2D SDfile   Computed 3D by Vconf -m prep SDfile
Find this compound or compounds like it in BindingDB:
Activity Spreadsheet -- Enzyme Inhibition Constant Data from BindingDB
Found 1 hit for monomerid = 314033
TargetC-C chemokine receptor type 5(Homo sapiens (Human))
Shanghai Institute Of Material Medica, Chinese Academy Of Sciences
US Patent
LigandPNGBDBM314033(US10167299, Example 147)
Affinity DataIC50:  2.48nM. Assay description: 1. HEK293 cells which can stably express CCR5 were inoculated in a 96-well plate and incubated overnight.2. The medium in each well into which cells ...
Ligand InfoPC cidPC sid
In DepthDetails US Patent