BDBM314120 3-[(4-methylbenzyl)amino]pyridine-4-carboxylic acid::US10179769, Example 24::US10807956, Example 24::US11214542, Example 24::US11639333, Example 24::US9611221, Example 24::US9725441, Example 24::US9828343, Example 24
SMILES Cc1ccc(CNc2cnccc2C(O)=O)cc1
InChI Key InChIKey=SZRSAUIAAXWQAM-UHFFFAOYSA-N
Data  9 IC50
  Tab Delimited (TSV)   2D SDfile   Computed 3D by Vconf -m prep SDfile
Find this compound or compounds like it in BindingDB:
Activity Spreadsheet -- Enzyme Inhibition Constant Data from BindingDB
Found 9 hits for monomerid = 314120
TargetLysine-specific demethylase 5A(Homo sapiens (Human))
Celgene Quanticel Research
US Patent
LigandPNGBDBM314120(3-[(4-methylbenzyl)amino]pyridine-4-carboxylic aci...)
Affinity DataIC50: <100nM. Assay description: The enzymatic assay of Jarid1A activity is based upon Time Resolved-Fluorescence Resonance Energy Transfer (TR-FRET) detection. The ability of test c...
Ligand InfoPC cidPC sid
In DepthDetails US Patent
TargetLysine-specific demethylase 5B(Homo sapiens (Human))
Celgene Quanticel Research
US Patent
LigandPNGBDBM314120(3-[(4-methylbenzyl)amino]pyridine-4-carboxylic aci...)
Affinity DataIC50: <100nM. Assay description: The ability of test compounds to inhibit the activity of Jarid1B was determined in 384-well plate format under the following reaction conditions: 0.8...
Ligand InfoPC cidPC sid
In DepthDetails US Patent
TargetLysine-specific demethylase 4C(Homo sapiens (Human))
Celgene Quanticel Research
US Patent
LigandPNGBDBM314120(3-[(4-methylbenzyl)amino]pyridine-4-carboxylic aci...)
Affinity DataIC50: <100nM. Assay description: The ability of test compounds to inhibit the activity of JMJD2C was determined in 384-well plate format under the following reaction conditions: 0.3 ...
Ligand InfoPC cidPC sid
In DepthDetails US Patent
TargetLysine-specific demethylase 5A(Homo sapiens (Human))
Celgene Quanticel Research
US Patent
LigandPNGBDBM314120(3-[(4-methylbenzyl)amino]pyridine-4-carboxylic aci...)
Affinity DataIC50: <100nM. Assay description: The enzymatic assay of Jarid1A activity is based upon Time Resolved-Fluorescence Resonance Energy Transfer (TR-FRET) detection. The ability of test c...
Ligand InfoPC cidPC sid
In DepthDetails US Patent
TargetLysine-specific demethylase 4C(Homo sapiens (Human))
Celgene Quanticel Research
US Patent
LigandPNGBDBM314120(3-[(4-methylbenzyl)amino]pyridine-4-carboxylic aci...)
Affinity DataIC50: <100nM. Assay description: JMJD2C: The ability of test compounds to inhibit the activity of JMJD2C was determined in 384-well plate format under the following reaction conditio...
Ligand InfoPC cidPC sid
In DepthDetails US Patent
TargetLysine-specific demethylase 5B(Homo sapiens (Human))
Celgene Quanticel Research
US Patent
LigandPNGBDBM314120(3-[(4-methylbenzyl)amino]pyridine-4-carboxylic aci...)
Affinity DataIC50: <100nM. Assay description: The ability of test compounds to inhibit the activity of JMJD2C was determined in 384-well plate format under the following reaction conditions: 0.3 ...
Ligand InfoPC cidPC sid
In DepthDetails US Patent
TargetLysine-specific demethylase 5A(Homo sapiens (Human))
Celgene Quanticel Research
US Patent
LigandPNGBDBM314120(3-[(4-methylbenzyl)amino]pyridine-4-carboxylic aci...)
Affinity DataIC50: <100nM. Assay description: Jarid1A: The enzymatic assay of Jarid1A activity is based upon Time Resolved-Fluorescence Resonance Energy Transfer (TR-FRET) detection. The ability ...
Ligand InfoPC cidPC sid
In DepthDetails US Patent
TargetLysine-specific demethylase 5B(Homo sapiens (Human))
Celgene Quanticel Research
US Patent
LigandPNGBDBM314120(3-[(4-methylbenzyl)amino]pyridine-4-carboxylic aci...)
Affinity DataIC50: <100nM. Assay description: Jarid1B: The ability of test compounds to inhibit the activity of Jarid1B was determined in 384 well plate format under the following reaction condit...
Ligand InfoPC cidPC sid
In DepthDetails US Patent
TargetLysine-specific demethylase 5B(Homo sapiens (Human))
Celgene Quanticel Research
US Patent
LigandPNGBDBM314120(3-[(4-methylbenzyl)amino]pyridine-4-carboxylic aci...)
Affinity DataIC50: <100nM. Assay description: The ability of test compounds to inhibit the activity of Jarid1B was determined in 384 well plate format under the following reaction conditions: 0.8...
Ligand InfoPC cidPC sid
In DepthDetails US Patent