BDBM314149 3-{[(5-fluoro-1,2,3,4-tetrahydronaphthalen-1-yl)methyl]amino}pyridine-4-carboxylic acid::US10179769, Example 54::US10807956, Example 54::US11214542, Example 54::US11639333, Example 54::US9611221, Example 54::US9725441, Example 54::US9828343, Example 54
SMILES OC(=O)c1ccncc1NCC1CCCc2c(F)cccc12
InChI Key InChIKey=MRJCKTYMDYDJPV-UHFFFAOYSA-N
Data  3 IC50
  Tab Delimited (TSV)   2D SDfile   Computed 3D by Vconf -m prep SDfile
Find this compound or compounds like it in BindingDB:
Activity Spreadsheet -- Enzyme Inhibition Constant Data from BindingDB
Found 3 hits for monomerid = 314149
TargetLysine-specific demethylase 5B(Homo sapiens (Human))
Celgene Quanticel Research
US Patent
LigandPNGBDBM314149(3-{[(5-fluoro-1,2,3,4-tetrahydronaphthalen-1-yl)me...)
Affinity DataIC50:  550nM. Assay description: The ability of test compounds to inhibit the activity of JMJD2C was determined in 384-well plate format under the following reaction conditions: 0.3 ...
Ligand InfoPC cidPC sid
In DepthDetails US Patent
TargetLysine-specific demethylase 4C(Homo sapiens (Human))
Celgene Quanticel Research
US Patent
LigandPNGBDBM314149(3-{[(5-fluoro-1,2,3,4-tetrahydronaphthalen-1-yl)me...)
Affinity DataIC50:  550nM. Assay description: JMJD2C: The ability of test compounds to inhibit the activity of JMJD2C was determined in 384-well plate format under the following reaction conditio...
Ligand InfoPC cidPC sid
In DepthDetails US Patent
TargetLysine-specific demethylase 4C(Homo sapiens (Human))
Celgene Quanticel Research
US Patent
LigandPNGBDBM314149(3-{[(5-fluoro-1,2,3,4-tetrahydronaphthalen-1-yl)me...)
Affinity DataIC50:  550nM. Assay description: The ability of test compounds to inhibit the activity of JMJD2C was determined in 384-well plate format under the following reaction conditions: 0.3 ...
Ligand InfoPC cidPC sid
In DepthDetails US Patent