BDBM31423 ethylenediamine scaffold, 4
SMILES Cn1cnc(c1)S(=O)(=O)N(CCN(Cc1cncn1C)c1ccc(cc1)C#N)CC1CCN(CC1)C(=O)OC(C)(C)C
InChI Key InChIKey=NYTPJJDEMIZHPE-UHFFFAOYSA-N
Data  6 IC50
PDB links: 1 PDB ID matches this monomer.
  Tab Delimited (TSV)   2D SDfile   Computed 3D by Vconf -m prep SDfile
Find this compound or compounds like it in BindingDB:
Activity Spreadsheet -- Enzyme Inhibition Constant Data from BindingDB
Found 6 hits for monomerid = 31423
TargetProtein farnesyltransferase subunit beta/geranylgeranyltransferase type-1 subunit alpha(Homo sapiens (Human))
Duke University Medical Center
LigandPNGBDBM31423(ethylenediamine scaffold, 4)
Affinity DataIC50:  3.70E+3nMpH: 7.7 T: 2°C. Assay description: In vitro inhibition assay of human PFT was done by measuring the incorporation of [3H] FPP (Amersham Biosciences, Piscataway, NJ) into wild type H-Ra...
TargetATP-dependent RNA helicase RhlE(Plasmodium falciparum (malaria parasite P. falcipa...)
Duke University Medical Center
LigandPNGBDBM31423(ethylenediamine scaffold, 4)
Affinity DataIC50:  1.20nMpH: 7.5 T: 2°C. Assay description: Assays for PfPFT activity were performed with a PFT-specific scintillation assay (SPA) kit (Amersham Biosciences, Piscataway, NJ). An amount of 1 uM ...
In DepthDetails ArticlePubMed
LigandPNGBDBM31423(ethylenediamine scaffold, 4)
Affinity DataIC50: >2.00E+3nM. Assay description: Inhibition of H-Ras-mediated farnesylation expressed in mouse NIH3T3 cells
LigandPNGBDBM31423(ethylenediamine scaffold, 4)
Affinity DataIC50: >2.00E+3nM. Assay description: Inhibition of Rap1A geranylgeranylation expressed in mouse NIH3T3 cells
LigandPNGBDBM31423(ethylenediamine scaffold, 4)
Affinity DataIC50: >1.00E+4nM. Assay description: Inhibition of human geranylgeranyltransferase-1 assessed as incorporation of [3H]GGPP into H-Ras-CVLL
TargetProtein farnesyltransferase subunit beta/geranylgeranyltransferase type-1 subunit alpha(Homo sapiens (Human))
Duke University Medical Center
LigandPNGBDBM31423(ethylenediamine scaffold, 4)
Affinity DataIC50:  3.70E+3nM. Assay description: Inhibition of human farnesyltransferase assessed as incorporation of [3H]FPP into H-Ras-CVLS