BDBM314251 (S)—N—((S)-1-((5-Fluoro-2-methoxynaphthalen-1-yl)methyl)-2-oxo-2,3,4,5-tetrahydro-1H-benzo[b]azepin-3-yl)-2-(methylamino)propanamide hydrochloride::US9611224, Example 64
SMILES CN[C@@H](C)C(=O)N[C@H]1CCc2ccccc2N(Cc2c(OC)ccc3c(F)cccc23)C1=O
InChI Key InChIKey=YJDUJLOEHCISDL-AOMKIAJQSA-N
Data  2 IC50
  Tab Delimited (TSV)   2D SDfile   Computed 3D by Vconf -m prep SDfile
Find this compound or compounds like it in BindingDB:
Activity Spreadsheet -- Enzyme Inhibition Constant Data from BindingDB
Found 2 hits for monomerid = 314251
TargetBaculoviral IAP repeat-containing protein 3(Homo sapiens (Human))
Hoffmann-La Roche
US Patent
LigandPNGBDBM314251((S)—N—((S)-1-((5-Fluoro-2-methoxynaphtha...)
Affinity DataIC50: >5.48E+4nM. Assay description: The peptide AVPIAQKSEK-(ε-biotin)-OH (SEQ ID NO: 1) 1:2 TFA (Peptide A) was identified as a substrate for the TR-FRET assay by screening the 6× ...
Ligand InfoPC cidPC sid
In DepthDetails US Patent
TargetBaculoviral IAP repeat-containing protein 2(Homo sapiens (Human))
Hoffmann-La Roche
US Patent
LigandPNGBDBM314251((S)—N—((S)-1-((5-Fluoro-2-methoxynaphtha...)
Affinity DataIC50:  53nM. Assay description: The peptide AVPIAQKSEK-(ε-biotin)-OH (SEQ ID NO: 1) 1:2 TFA (Peptide A) was identified as a substrate for the TR-FRET assay by screening the 6× ...
Ligand InfoPC cidPC sid
In DepthDetails US Patent