BDBM314283 US9611222, Example 108
SMILES Cc1cc(cc(n1)-c1ccc(Oc2ccc(F)cc2)cc1)-c1nnn(CC(N)=O)n1
InChI Key InChIKey=GHVJIJSQIRVEHW-UHFFFAOYSA-N
Data  1 IC50
  Tab Delimited (TSV)   2D SDfile   Computed 3D by Vconf -m prep SDfile
Find this compound or compounds like it in BindingDB:
Activity Spreadsheet -- Enzyme Inhibition Constant Data from BindingDB
Found 1 hit for monomerid = 314283
TargetSodium channel protein type 9 subunit alpha(Homo sapiens (Human))
Purdue Pharma
US Patent
LigandPNGBDBM314283(US9611222, Example 108)
Affinity DataIC50:  130nM. Assay description: In vitro assays were performed in a recombinant cell line expressing cDNA encoding the alpha subunit (Nav1.7, SCN9a, PN1, NE) of human Nav1.7 (Access...
Ligand InfoPC cidPC sid
In DepthDetails US Patent