BDBM314381 N-{[1-(2-methoxyethyl)pipendin-4- yl]methyl}-5-phenyl-1H-indazole-3- carboxamide::US9611249, Compound 9
SMILES COCCN1CCC(CNC(=O)c2n[nH]c3ccc(cc23)-c2ccccc2)CC1
InChI Key InChIKey=NYZULOOKYVABFY-UHFFFAOYSA-N
Data  1 IC50
  Tab Delimited (TSV)   2D SDfile   Computed 3D by Vconf -m prep SDfile
Find this compound or compounds like it in BindingDB:
Activity Spreadsheet -- Enzyme Inhibition Constant Data from BindingDB
Found 1 hit for monomerid = 314381
TargetGlycogen synthase kinase-3 beta(Homo sapiens (Human))
Angelini Acraf
US Patent
LigandPNGBDBM314381(N-{[1-(2-methoxyethyl)pipendin-4- yl]methyl}-5-phe...)
Affinity DataIC50:  200nM. Assay description: Activity on human GSK-3β was assessed using the following methods (according to Meijer et al., Chem. Biol., 2003-10:1255-1266).In a first screen...
Ligand InfoPC cidPC sid
In DepthDetails US Patent