BDBM314571 (3-fluoro-2-(pyrimidin-2-yl)phenyl)((2S*,3R*)-2-methyl-3-((5-(trifluoromethyl)pyridin-2-yl)amino)piperidin-1-yl)methanone::US9611251, 189
SMILES C[C@H]1[C@@H](CCCN1C(=O)c1cccc(F)c1-c1ncccn1)Nc1ccc(cn1)C(F)(F)F
InChI Key InChIKey=LXAUAYZMPQRYNH-KBXCAEBGSA-N
Data  3 KI
  Tab Delimited (TSV)   2D SDfile   Computed 3D by Vconf -m prep SDfile
Find this compound or compounds like it in BindingDB:
Activity Spreadsheet -- Enzyme Inhibition Constant Data from BindingDB
Found 3 hits for monomerid = 314571
TargetOrexin/Hypocretin receptor type 1(Homo sapiens (Human))
Janssen Pharmaceutica
US Patent
LigandPNGBDBM314571((3-fluoro-2-(pyrimidin-2-yl)phenyl)((2S*,3R*)-2-me...)
Affinity DataKi:  5nM. Assay description: Human Embryonic Kidney 293 cells (HEK293) stably expressing rat orexin 1 receptor (Genebank accession number NM_001525) or Chinese ovary cells (CHO) ...
Ligand InfoPC cidPC sid
In DepthDetails US Patent
TargetOrexin/Hypocretin receptor type 1(Rattus norvegicus (Rat))
Janssen Pharmaceutica
US Patent
LigandPNGBDBM314571((3-fluoro-2-(pyrimidin-2-yl)phenyl)((2S*,3R*)-2-me...)
Affinity DataKi:  7nM. Assay description: HEK293 stably expressing human orexin 2 receptor (Genebank accession number NM_001526) were grown to confluency in DMEM (Hyclone, cat #SH30022), 10% ...
Ligand InfoPC cidPC sid
In DepthDetails US Patent
TargetOrexin receptor type 2(Homo sapiens (Human))
Janssen Pharmaceutica
US Patent
LigandPNGBDBM314571((3-fluoro-2-(pyrimidin-2-yl)phenyl)((2S*,3R*)-2-me...)
Affinity DataKi:  175nM. Assay description: Human Embryonic Kidney 293 cells (HEK293) stably expressing rat orexin 1 receptor (Genebank accession number NM_001525) or Chinese ovary cells (CHO) ...
Ligand InfoPC cidPC sid
In DepthDetails US Patent