BDBM314681 (R/S)-[2-ethyl-5-[[5-(trifluoromethyl)-2-pyridyl]oxy]-3-azabicyclo[2.2.1]heptan-3-yl]-[2-(triazol-2-yl)phenyl]methanone::US9611262, Example 213
SMILES CCC1C2CC(Oc3ccc(cn3)C(F)(F)F)C(C2)N1C(=O)c1ccccc1-n1nccn1
InChI Key InChIKey=ANGJUQYZBGLNMK-UHFFFAOYSA-N
Data  3 KI
  Tab Delimited (TSV)   2D SDfile   Computed 3D by Vconf -m prep SDfile
Find this compound or compounds like it in BindingDB:
Activity Spreadsheet -- Enzyme Inhibition Constant Data from BindingDB
Found 3 hits for monomerid = 314681
TargetOrexin/Hypocretin receptor type 1(Homo sapiens (Human))
Janssen Pharmaceutica
US Patent
LigandPNGBDBM314681((R/S)-[2-ethyl-5-[[5-(trifluoromethyl)-2-pyridyl]o...)
Affinity DataKi:  2nM. Assay description: HEK293 stably expressing human orexin 2 receptor (Genebank accession number NM_001526) were grown to confluency in DMEM (Hyclone, cat # SH30022), 10%...
Ligand InfoPC cidPC sid
In DepthDetails US Patent
TargetOrexin/Hypocretin receptor type 1(Rattus norvegicus (Rat))
Janssen Pharmaceutica
US Patent
LigandPNGBDBM314681((R/S)-[2-ethyl-5-[[5-(trifluoromethyl)-2-pyridyl]o...)
Affinity DataKi:  4nM. Assay description: Human Embryonic Kidney 293 cells (HEK293) stably expressing rat orexin 1 receptor (Genebank accession number NM_001525) or Chinese ovary cells (CHO) ...
Ligand InfoPC cidPC sid
In DepthDetails US Patent
TargetOrexin receptor type 2(Homo sapiens (Human))
Janssen Pharmaceutica
US Patent
LigandPNGBDBM314681((R/S)-[2-ethyl-5-[[5-(trifluoromethyl)-2-pyridyl]o...)
Affinity DataKi:  208nM. Assay description: Human Embryonic Kidney 293 cells (HEK293) stably expressing rat orexin 1 receptor (Genebank accession number NM_001525) or Chinese ovary cells (CHO) ...
Ligand InfoPC cidPC sid
In DepthDetails US Patent