BDBM314714 US11214573, Example 27::US9611269, Example 27
SMILES CC(C)NC(=O)c1ccc(N2CC(CC#N)(C2)n2cc(cn2)-c2ccnc3[nH]ccc23)c(F)c1
InChI Key InChIKey=RSGDBTCJSVBZDE-UHFFFAOYSA-N
Data  4 IC50
  Tab Delimited (TSV)   2D SDfile   Computed 3D by Vconf -m prep SDfile
Find this compound or compounds like it in BindingDB:
Activity Spreadsheet -- Enzyme Inhibition Constant Data from BindingDB
Found 4 hits for monomerid = 314714
TargetTyrosine-protein kinase JAK1(Homo sapiens (Human))
Incyte
US Patent
LigandPNGBDBM314714(US11214573, Example 27 | US9611269, Example 27)
Affinity DataIC50: <10nM. Assay description: Compounds herein were tested for inhibitory activity of JAK targets according to the following in vitro assay described in Park et al., Analytical Bi...
Ligand InfoPC cidPC sid
In DepthDetails US Patent
TargetTyrosine-protein kinase JAK2 [828-1132](Homo sapiens (Human))
Incyte Holdings
US Patent
LigandPNGBDBM314714(US11214573, Example 27 | US9611269, Example 27)
Affinity DataIC50: <10nM. Assay description: The catalytic domains of human JAK1 (a.a. 837-1142), JAK2 (a.a. 828-1132) and JAK3 (a.a. 781-1124) with an N-terminal His tag were expressed using ba...
Ligand InfoPC cidPC sid
In DepthDetails US Patent
TargetTyrosine-protein kinase JAK1 [837-1142](Homo sapiens (Human))
Incyte Holdings
US Patent
LigandPNGBDBM314714(US11214573, Example 27 | US9611269, Example 27)
Affinity DataIC50: <10nM. Assay description: The catalytic domains of human JAK1 (a.a. 837-1142), JAK2 (a.a. 828-1132) and JAK3 (a.a. 781-1124) with an N-terminal His tag were expressed using ba...
Ligand InfoPC cidPC sid
In DepthDetails US Patent
TargetTyrosine-protein kinase JAK2(Homo sapiens (Human))
Incyte
US Patent
LigandPNGBDBM314714(US11214573, Example 27 | US9611269, Example 27)
Affinity DataIC50: <10nM. Assay description: Compounds herein were tested for inhibitory activity of JAK targets according to the following in vitro assay described in Park et al., Analytical Bi...
Ligand InfoPC cidPC sid
In DepthDetails US Patent