BDBM31474 substituted biphenyl derivative, 36n
SMILES CC(C)CNC(=O)c1ccc(c(c1)C(O)=O)-c1ccc(cc1C(=O)Nc1ccc(cc1)C(N)=N)C(=C)CO
InChI Key InChIKey=KTKCXWRXASRRSD-UHFFFAOYSA-N
Data  5 IC50
  Tab Delimited (TSV)   2D SDfile   Computed 3D by Vconf -m prep SDfile
Find this compound or compounds like it in BindingDB:
Activity Spreadsheet -- Enzyme Inhibition Constant Data from BindingDB
Found 5 hits for monomerid = 31474
TargetCoagulation factor VII(Homo sapiens (Human))
Biocryst Pharmaceuticals
LigandPNGBDBM31474(substituted biphenyl derivative, 36n)
Affinity DataIC50:  12nMpH: 7.2 T: 2°C. Assay description: TF-FVIIa assay reactions were performed in a mixture containing FVIIa , lapidated tissue factor, in an assay buffer in the presence of test compounds...
In DepthDetails ArticlePubMed
TargetSerine protease 1(Bos taurus (bovine))
Biocryst Pharmaceuticals
LigandPNGBDBM31474(substituted biphenyl derivative, 36n)
Affinity DataIC50:  3.54E+3nMT: 2°C. Assay description: Trypsin assay reactions were performed in a mixture containing trypsin, and test compounds were added at varied concentrations. The reactions were in...
In DepthDetails ArticlePubMed
TargetCoagulation factor X(Homo sapiens (Human))
Biocryst Pharmaceuticals
LigandPNGBDBM31474(substituted biphenyl derivative, 36n)
Affinity DataIC50:  7.10E+3nMT: 2°C. Assay description: FXa assay reactions were performed in a reaction mixture containing FXa, and test compounds were added at varied concentrations and reactions were in...
In DepthDetails ArticlePubMed
TargetProthrombin(Homo sapiens (Human))
Biocryst Pharmaceuticals
LigandPNGBDBM31474(substituted biphenyl derivative, 36n)
Affinity DataIC50:  3.97E+4nMT: 2°C. Assay description: Thrombin assay reactions were performed in a reaction mixture containing thrombin, and test compounds were added at varied concentrations. The reacti...
In DepthDetails ArticlePubMed
TargetPlasminogen(Homo sapiens (Human))
Biocryst Pharmaceuticals
LigandPNGBDBM31474(substituted biphenyl derivative, 36n)
Affinity DataIC50:  810nMT: 2°C. Assay description: The assay is an amidolytic assay based upon the absorbance of derivatized thiols from the hydrolysis of Z-Lys-SBzl (Bachem) in the presence of 5,5-Di...
In DepthDetails ArticlePubMed