BDBM314782 (3aR,5S,6S,7R,7aR)-2- (dimethylamino)-5-((R)-2,2,2- trifluoro-1-(2- fluorobenzyloxy)ethyl)-5,6,7,7a- tetrahydro-3aH-pyrano[3,2- d]thiazole-6,7-diol::US9611275, Example 61
SMILES CN(C)C1=N[C@H]2[C@H](O[C@H]([C@@H](OCc3ccccc3F)C(F)(F)F)[C@@H](O)[C@@H]2O)S1
InChI Key InChIKey=BIDHHVHQYNQWCC-PEZGRIKUSA-N
Data  1 KI
  Tab Delimited (TSV)   2D SDfile   Computed 3D by Vconf -m prep SDfile
Find this compound or compounds like it in BindingDB:
Activity Spreadsheet -- Enzyme Inhibition Constant Data from BindingDB
Found 1 hit for monomerid = 314782
TargetProtein O-GlcNAcase(Homo sapiens (Human))
Alectos Therapeutics
US Patent
LigandPNGBDBM314782((3aR,5S,6S,7R,7aR)-2- (dimethylamino)-5-((R)-2,2,2...)
Affinity DataKi:  1.98nM. Assay description: Enzymatic reactions were carried out in a reaction containing 50 mM NaH2PO4, 100 mM NaCl and 0.1% BSA (pH 7.0) using 2 mM 4-Methylumbelliferyl N-acet...
Ligand InfoPC cidPC sid
In DepthDetails US Patent