BDBM314817 (−) (R) 3-{3-[(Cyclopentyl{4-[5-(trifluoromethyl)pyridin-3-yl]phenyl}acetyl)amino]-2-methylphenyl}propanoic acid::US10172814, Example 2
SMILES Cc1c(CCC(O)=O)cccc1NC(=O)[C@H](C1CCCC1)c1ccc(cc1)-c1cncc(c1)C(F)(F)F
InChI Key InChIKey=BQUFVNCYDJQTBE-HHHXNRCGSA-N
Data  3 IC50
  Tab Delimited (TSV)   2D SDfile   Computed 3D by Vconf -m prep SDfile
Find this compound or compounds like it in BindingDB:
Activity Spreadsheet -- Enzyme Inhibition Constant Data from BindingDB
Found 3 hits for monomerid = 314817
TargetProstaglandin G/H synthase 2(Homo sapiens (Human))
Bayer Pharma Aktiengesellschaft
US Patent
LigandPNGBDBM314817((−) (R) 3-{3-[(Cyclopentyl{4-[5-(trifluorome...)
Affinity DataIC50:  21nM. Assay description: Recombinant proteins (human isoforms) of PTGES containing a FLAG tag, expressed in baculovirus infected insect cells (Hi-5) and purified by affinity ...
Ligand InfoPC cidPC sid
In DepthDetails US Patent
TargetProstaglandin E synthase(Homo sapiens (Human))
Bayer
Curated by ChEMBL
LigandPNGBDBM314817((−) (R) 3-{3-[(Cyclopentyl{4-[5-(trifluorome...)
Affinity DataIC50:  20nM. Assay description: Inhibition of human recombinant FLAG-tagged PTGES expressed in baculovirus infected Hi-5 insect cells using prostaglandin H2 as substrate preincubate...
Ligand InfoPC cidPC sid
In DepthDetails ArticlePubMed
TargetProstaglandin G/H synthase 2(Homo sapiens (Human))
Bayer Pharma Aktiengesellschaft
US Patent
LigandPNGBDBM314817((−) (R) 3-{3-[(Cyclopentyl{4-[5-(trifluorome...)
Affinity DataIC50:  20.4nM. Assay description: Recombinant proteins (human isoforms) of PTGES containing a FLAG tag, expressed in baculovirus infected insect cells (Hi-5) and purified by affinity ...
Ligand InfoPC cidPC sid
In DepthDetails US Patent