BDBM314847 (3-methyl-2-(oxazol-2-yl)phenyl)((1S,4R,6R)-6-((5-(trifluoromethyl)pyridin-2-yl)oxy)-2-azabicyclo[2.2.1]heptan-2-yl)methanone::US9611277, Example 32
SMILES Cc1ccc(OC2CC3CC2N(C3)C(=O)c2cccc(C)c2-c2ncco2)nc1
InChI Key InChIKey=JNRNJLLAPRHTBB-UHFFFAOYSA-N
Data  6 KI
  Tab Delimited (TSV)   2D SDfile   Computed 3D by Vconf -m prep SDfile
Find this compound or compounds like it in BindingDB:
Activity Spreadsheet -- Enzyme Inhibition Constant Data from BindingDB
Found 6 hits for monomerid = 314847
TargetOrexin/Hypocretin receptor type 1(Rattus norvegicus (Rat))
Janssen Pharmaceutica
US Patent
LigandPNGBDBM314847((3-methyl-2-(oxazol-2-yl)phenyl)((1S,4R,6R)-6-((5-...)
Affinity DataKi:  3nM. Assay description: Human Embryonic Kidney 293 cells (HEK293) stably expressing rat orexin 1 receptor (Genebank accession number NM_001525) or Chinese ovary cells (CHO) ...
Ligand InfoPC cidPC sid
In DepthDetails US Patent
TargetOrexin/Hypocretin receptor type 1(Rattus norvegicus (Rat))
Janssen Pharmaceutica
US Patent
LigandPNGBDBM314847((3-methyl-2-(oxazol-2-yl)phenyl)((1S,4R,6R)-6-((5-...)
Affinity DataKi:  3nM. Assay description: Human Embryonic Kidney 293 cells (HEK293) stably expressing rat orexin 1 receptor (Genebank accession number NM_001525) or Chinese ovary cells (CHO) ...
Ligand InfoPC cidPC sid
In DepthDetails US Patent
TargetOrexin/Hypocretin receptor type 1(Homo sapiens (Human))
Janssen Pharmaceutica
US Patent
LigandPNGBDBM314847((3-methyl-2-(oxazol-2-yl)phenyl)((1S,4R,6R)-6-((5-...)
Affinity DataKi:  4nM. Assay description: HEK293 stably expressing human orexin 2 receptor (Genebank accession number NM_001526) were grown to confluency in DMEM (Hyclone, cat # SH30022), 10%...
Ligand InfoPC cidPC sid
In DepthDetails US Patent
TargetOrexin/Hypocretin receptor type 1(Homo sapiens (Human))
Janssen Pharmaceutica
US Patent
LigandPNGBDBM314847((3-methyl-2-(oxazol-2-yl)phenyl)((1S,4R,6R)-6-((5-...)
Affinity DataKi:  6nM. Assay description: HEK293 stably expressing human orexin 2 receptor (Genebank accession number NM_001526) were grown to confluency in DMEM (Hyclone, cat # SH30022), 10%...
Ligand InfoPC cidPC sid
In DepthDetails US Patent
TargetOrexin receptor type 2(Homo sapiens (Human))
Janssen Pharmaceutica
US Patent
LigandPNGBDBM314847((3-methyl-2-(oxazol-2-yl)phenyl)((1S,4R,6R)-6-((5-...)
Affinity DataKi:  143nM. Assay description: HEK293 stably expressing human orexin 2 receptor (Genebank accession number NM_001526) were grown to confluency in DMEM (Hyclone, cat # SH30022), 10%...
Ligand InfoPC cidPC sid
In DepthDetails US Patent
TargetOrexin receptor type 2(Homo sapiens (Human))
Janssen Pharmaceutica
US Patent
LigandPNGBDBM314847((3-methyl-2-(oxazol-2-yl)phenyl)((1S,4R,6R)-6-((5-...)
Affinity DataKi:  149nM. Assay description: HEK293 stably expressing human orexin 2 receptor (Genebank accession number NM_001526) were grown to confluency in DMEM (Hyclone, cat # SH30022), 10%...
Ligand InfoPC cidPC sid
In DepthDetails US Patent